Reaction Details
TargetExtracellular calcium-sensing receptor
LigandBDBM50432117
Substrate/Competitorn/a
Meas. Tech.ChEMBL_950625 (CHEMBL2352375)
EC50 300±n/a nM
Citation Temal, TJary, HAuberval, MLively, SGuédin, DVevert, JPDeprez, P New potent calcimimetics: I. Discovery of a series of novel trisubstituted ureas. Bioorg Med Chem Lett23:2451-4 (2013) 
 
Extracellular calcium-sensing receptor
Name:Extracellular calcium-sensing receptor
Type:Protein
Mol. Mass.:120663.13
Organism:Homo sapiens (Human)
Description:P41180
Residue:1078
BDBM50432117
NameBDBM50432117
Synonyms:CHEMBL2349605
TypeSmall organic molecule
Emp. Form.C31H34N4O2S
Mol. Mass.526.692
SMILESO=C(Nc1cccc(c1)-c1nccs1)N(CCC(c1ccccc1)c1ccccc1)CCN1CCOCC1