Reaction Details
TargetExtracellular calcium-sensing receptor
LigandBDBM50432126
Substrate/Competitorn/a
Meas. Tech.ChEMBL_950625 (CHEMBL2352375)
EC50 800±n/a nM
Citation Temal, TJary, HAuberval, MLively, SGuédin, DVevert, JPDeprez, P New potent calcimimetics: I. Discovery of a series of novel trisubstituted ureas. Bioorg Med Chem Lett23:2451-4 (2013) 
 
Extracellular calcium-sensing receptor
Name:Extracellular calcium-sensing receptor
Type:Protein
Mol. Mass.:120663.13
Organism:Homo sapiens (Human)
Description:P41180
Residue:1078
BDBM50432126
NameBDBM50432126
Synonyms:CHEMBL2349596
TypeSmall organic molecule
Emp. Form.C29H32N4O2
Mol. Mass.468.59
SMILESO=C(Nc1cccc(c1)C#N)N(CCC(c1ccccc1)c1ccccc1)CCN1CCOCC1