Reaction Details
TargetExtracellular calcium-sensing receptor
LigandBDBM50432150
Substrate/Competitorn/a
Meas. Tech.ChEMBL_950625 (CHEMBL2352375)
EC50 800±n/a nM
Citation Temal, TJary, HAuberval, MLively, SGuédin, DVevert, JPDeprez, P New potent calcimimetics: I. Discovery of a series of novel trisubstituted ureas. Bioorg Med Chem Lett23:2451-4 (2013) 
 
Extracellular calcium-sensing receptor
Name:Extracellular calcium-sensing receptor
Type:Protein
Mol. Mass.:120663.13
Organism:Homo sapiens (Human)
Description:P41180
Residue:1078
BDBM50432150
NameBDBM50432150
Synonyms:CHEMBL2346784
TypeSmall organic molecule
Emp. Form.C30H34N2O5
Mol. Mass.502.6014
SMILESCOC(=O)c1cccc(NC(=O)N(CCC(c2ccccc2)c2ccccc2)CC(=O)OC(C)(C)C)c1