Reaction Details
TargetExtracellular calcium-sensing receptor
LigandBDBM50432158
Substrate/Competitorn/a
Meas. Tech.ChEMBL_950625 (CHEMBL2352375)
EC50 3000±n/a nM
Citation Temal, TJary, HAuberval, MLively, SGuédin, DVevert, JPDeprez, P New potent calcimimetics: I. Discovery of a series of novel trisubstituted ureas. Bioorg Med Chem Lett23:2451-4 (2013) 
 
Extracellular calcium-sensing receptor
Name:Extracellular calcium-sensing receptor
Type:Protein
Mol. Mass.:120663.13
Organism:Homo sapiens (Human)
Description:P41180
Residue:1078
BDBM50432158
NameBDBM50432158
Synonyms:CHEMBL2346777
TypeSmall organic molecule
Emp. Form.C23H20ClF3N2O
Mol. Mass.432.866
SMILESFC(F)(F)c1cc(NC(=O)NCCC(c2ccccc2)c2ccccc2)ccc1Cl