Reaction Details
TargetExtracellular calcium-sensing receptor
LigandBDBM50432159
Substrate/Competitorn/a
Meas. Tech.ChEMBL_950625 (CHEMBL2352375)
EC50 2000±n/a nM
Citation Temal, TJary, HAuberval, MLively, SGuédin, DVevert, JPDeprez, P New potent calcimimetics: I. Discovery of a series of novel trisubstituted ureas. Bioorg Med Chem Lett23:2451-4 (2013) 
 
Extracellular calcium-sensing receptor
Name:Extracellular calcium-sensing receptor
Type:Protein
Mol. Mass.:120663.13
Organism:Homo sapiens (Human)
Description:P41180
Residue:1078
BDBM50432159
NameBDBM50432159
Synonyms:CHEMBL2346776
TypeSmall organic molecule
Emp. Form.C24H23ClN2O3
Mol. Mass.422.904
SMILESCOC(=O)c1cc(NC(=O)NCCC(c2ccccc2)c2ccccc2)ccc1Cl