Reaction Details
TargetExtracellular calcium-sensing receptor
LigandBDBM50432162
Substrate/Competitorn/a
Meas. Tech.ChEMBL_950625 (CHEMBL2352375)
EC50 4000±n/a nM
Citation Temal, TJary, HAuberval, MLively, SGuédin, DVevert, JPDeprez, P New potent calcimimetics: I. Discovery of a series of novel trisubstituted ureas. Bioorg Med Chem Lett23:2451-4 (2013) 
 
Extracellular calcium-sensing receptor
Name:Extracellular calcium-sensing receptor
Type:Protein
Mol. Mass.:120663.13
Organism:Homo sapiens (Human)
Description:P41180
Residue:1078
BDBM50432162
NameBDBM50432162
Synonyms:1-(3,3-diphenylpropyl)-3-p-tolylurea | CHEMBL2346773
TypeSmall organic molecule
Emp. Form.C23H24N2O
Mol. Mass.344.4495
SMILESCc1ccc(NC(=O)NCCC(c2ccccc2)c2ccccc2)cc1