Reaction Details
TargetCannabinoid receptor 1
LigandBDBM50432191
Substrate/Competitorn/a
Meas. Tech.ChEMBL_950673 (CHEMBL2352676)
Ki 85±n/a nM
Citation Madadi, NRPenthala, NRBrents, LKFord, BMPrather, PLCrooks, PA Evaluation of (Z)-2-((1-benzyl-1H-indol-3-yl)methylene)-quinuclidin-3-one analogues as novel, high affinity ligands for CB1 and CB2 cannabinoid receptors. Bioorg Med Chem Lett23:2019-21 (2013) 
 
Cannabinoid receptor 1
Name:Cannabinoid receptor 1
Type:Enzyme
Mol. Mass.:52842.52
Organism:Mus musculus (Mouse)
Description:P47746
Residue:473
BDBM50432191
NameBDBM50432191
Synonyms:CHEMBL391430
TypeSmall organic molecule
Emp. Form.C23H23ClN2O
Mol. Mass.378.895
SMILESOC1C2CCN(CC2)\C1=C/c1cn(Cc2ccc(Cl)cc2)c2ccccc12