Reaction Details
TargetCannabinoid receptor 1
LigandBDBM50432193
Substrate/Competitorn/a
Meas. Tech.ChEMBL_950673 (CHEMBL2352676)
Ki 86±n/a nM
Citation Madadi, NRPenthala, NRBrents, LKFord, BMPrather, PLCrooks, PA Evaluation of (Z)-2-((1-benzyl-1H-indol-3-yl)methylene)-quinuclidin-3-one analogues as novel, high affinity ligands for CB1 and CB2 cannabinoid receptors. Bioorg Med Chem Lett23:2019-21 (2013) 
 
Cannabinoid receptor 1
Name:Cannabinoid receptor 1
Type:Enzyme
Mol. Mass.:52842.52
Organism:Mus musculus (Mouse)
Description:P47746
Residue:473
BDBM50432193
NameBDBM50432193
Synonyms:CHEMBL2346979
TypeSmall organic molecule
Emp. Form.C25H24N2O3
Mol. Mass.400.4697
SMILESCOC(=O)c1ccc2c(C=C3N4CCC(CC4)C3=O)cn(Cc3ccccc3)c2c1