Reaction Details
TargetCannabinoid receptor 1
LigandBDBM50432195
Substrate/Competitorn/a
Meas. Tech.ChEMBL_950673 (CHEMBL2352676)
Ki 55±n/a nM
Citation Madadi, NRPenthala, NRBrents, LKFord, BMPrather, PLCrooks, PA Evaluation of (Z)-2-((1-benzyl-1H-indol-3-yl)methylene)-quinuclidin-3-one analogues as novel, high affinity ligands for CB1 and CB2 cannabinoid receptors. Bioorg Med Chem Lett23:2019-21 (2013) 
 
Cannabinoid receptor 1
Name:Cannabinoid receptor 1
Type:Enzyme
Mol. Mass.:52842.52
Organism:Mus musculus (Mouse)
Description:P47746
Residue:473
BDBM50432195
NameBDBM50432195
Synonyms:CHEMBL2346977
TypeSmall organic molecule
Emp. Form.C24H21N3O
Mol. Mass.367.443
SMILESO=C1C2CCN(CC2)C1=Cc1cn(Cc2ccc(cc2)C#N)c2ccccc12