Reaction Details
TargetKynurenine/alpha-aminoadipate aminotransferase, mitochondrial
LigandBDBM50432200
Substrate/Competitorn/a
Meas. Tech.ChEMBL_950925 (CHEMBL2349998)
IC50 85±n/a nM
Citation Dounay, ABAnderson, MBechle, BMEvrard, EGan, XKim, JYMcAllister, LAPandit, JRong, SSalafia, MATuttle, JBZawadzke, LEVerhoest, PR PF-04859989 as a template for structure-based drug design: identification of new pyrazole series of irreversible KAT II inhibitors with improved lipophilic efficiency. Bioorg Med Chem Lett23:1961-6 (2013) 
 
Kynurenine/alpha-aminoadipate aminotransferase, mitochondrial
Name:Kynurenine/alpha-aminoadipate aminotransferase, mitochondrial
Type:Enzyme
Mol. Mass.:47353.09
Organism:Homo sapiens (Human)
Description:Q8N5Z0
Residue:425
BDBM50432200
NameBDBM50432200
Synonyms:CHEMBL2347109 | US8933095, 16
TypeSmall organic molecule
Emp. Form.C12H12N4O2
Mol. Mass.244.2493
SMILESN[C@H]1Cc2nn(cc2N(O)C1=O)-c1ccccc1