Reaction Details
TargetKynurenine/alpha-aminoadipate aminotransferase, mitochondrial
LigandBDBM107720
Substrate/Competitorn/a
Meas. Tech.ChEMBL_950925 (CHEMBL2349998)
Ki 32±n/a nM
Citation Dounay, ABAnderson, MBechle, BMEvrard, EGan, XKim, JYMcAllister, LAPandit, JRong, SSalafia, MATuttle, JBZawadzke, LEVerhoest, PR PF-04859989 as a template for structure-based drug design: identification of new pyrazole series of irreversible KAT II inhibitors with improved lipophilic efficiency. Bioorg Med Chem Lett23:1961-6 (2013) 
 
Kynurenine/alpha-aminoadipate aminotransferase, mitochondrial
Name:Kynurenine/alpha-aminoadipate aminotransferase, mitochondrial
Type:Enzyme
Mol. Mass.:47353.09
Organism:Homo sapiens (Human)
Description:Q8N5Z0
Residue:425
BDBM107720
NameBDBM107720
Synonyms:CHEMBL2347112 | US8598200, 2
TypeSmall organic molecule
Emp. Form.C14H16N4O2
Mol. Mass.272.3024
SMILESCn1nc(Cc2ccccc2)c2C[C@H](N)C(=O)N(O)c12