Reaction Details
TargetLactase/phlorizin hydrolase
LigandBDBM50432224
Substrate/Competitorn/a
Meas. Tech.ChEMBL_950939 (CHEMBL2350012)
IC50 100940±n/a nM
Citation Bian, XWang, QKe, CZhao, GLi, Y A new series of N2-substituted-5-(p-toluenesulfonylamino)phthalimide analogues asa-glucosidase inhibitors. Bioorg Med Chem Lett23:2022-6 (2013) 
 
Lactase/phlorizin hydrolase
Name:Lactase/phlorizin hydrolase
Type:PROTEIN
Mol. Mass.:217253.31
Organism:Rattus norvegicus
Description:ChEMBL_96426
Residue:1928
BDBM50432224
NameBDBM50432224
Synonyms:CHEMBL2347141
TypeSmall organic molecule
Emp. Form.C22H16Cl2N2O4S
Mol. Mass.475.344
SMILESCc1ccc(cc1)S(=O)(=O)Nc1ccc2C(=O)N(Cc3ccc(Cl)c(Cl)c3)C(=O)c2c1