Reaction Details
TargetCytochrome P450 2D6
LigandBDBM50432234
Substrate/Competitorn/a
Meas. Tech.ChEMBL_950949 (CHEMBL2350275)
IC50 62100±n/a nM
Citation Amblard, FZhang, HZhou, LShi, JBobeck, DRNettles, JHChavre, SMcBrayer, TRTharnish, PWhitaker, TCoats, SJSchinazi, RF Synthesis and evaluation of non-dimeric HCV NS5A inhibitors. Bioorg Med Chem Lett23:2031-4 (2013) 
 
Cytochrome P450 2D6
Name:Cytochrome P450 2D6
Type:Protein
Mol. Mass.:55774.82
Organism:Homo sapiens (Human)
Description:P10635
Residue:497
BDBM50432234
NameBDBM50432234
Synonyms:CHEMBL2347328
TypeSmall organic molecule
Emp. Form.C27H29F3N4O3
Mol. Mass.514.5394
SMILESCOC(=O)N[C@@H](C(C)C)C(=O)N1CCC[C@H]1c1nc(c[nH]1)-c1ccc(cc1)-c1ccc(cc1)C(F)(F)F