Reaction Details
TargetCytochrome P450 3A4
LigandBDBM50432233
Substrate/Competitorn/a
Meas. Tech.ChEMBL_950952 (CHEMBL2350278)
IC50 6900±n/a nM
Citation Amblard, FZhang, HZhou, LShi, JBobeck, DRNettles, JHChavre, SMcBrayer, TRTharnish, PWhitaker, TCoats, SJSchinazi, RF Synthesis and evaluation of non-dimeric HCV NS5A inhibitors. Bioorg Med Chem Lett23:2031-4 (2013) 
 
Cytochrome P450 3A4
Name:Cytochrome P450 3A4
Type:Enzyme
Mol. Mass.:57349.57
Organism:Homo sapiens (Human)
Description:n/a
Residue:503
BDBM50432233
NameBDBM50432233
Synonyms:CHEMBL2347337
TypeSmall organic molecule
Emp. Form.C27H32N4O4
Mol. Mass.476.5674
SMILESCOC(=O)N[C@@H](C(C)C)C(=O)N1CCC[C@H]1c1nc(c[nH]1)-c1ccc(cc1)-c1ccc(CO)cc1