Reaction Details
TargetSubstance-P receptor
LigandBDBM50432299
Substrate/Competitorn/a
Meas. Tech.ChEMBL_951591 (CHEMBL2351266)
IC50 2.6±n/a nM
Citation Wu, YJHe, HBertekap, RWestphal, RLelas, SNewton, AWallace, TTaber, MDavis, CMacor, JEBronson, J Discovery of disubstituted piperidines and homopiperidines as potent dual NK1 receptor antagonists-serotonin reuptake transporter inhibitors for the treatment of depression. Bioorg Med Chem21:2217-28 (2013) 
 
Substance-P receptor
Name:Substance-P receptor
Type:G Protein-Coupled Receptor (GPCR)
Mol. Mass.:46254.43
Organism:Homo sapiens (Human)
Description:P25103
Residue:407
BDBM50432299
NameBDBM50432299
Synonyms:CHEMBL2347854
TypeSmall organic molecule
Emp. Form.C23H25F6NO
Mol. Mass.445.4411
SMILESCN1CCC[C@@](COCc2cc(cc(c2)C(F)(F)F)C(F)(F)F)(CC1)c1ccccc1