Reaction Details
TargetSubstance-P receptor
LigandBDBM50034271
Substrate/Competitorn/a
Meas. Tech.ChEMBL_951591 (CHEMBL2351266)
IC50 1.000000±n/a nM
Citation Wu, YJHe, HBertekap, RWestphal, RLelas, SNewton, AWallace, TTaber, MDavis, CMacor, JEBronson, J Discovery of disubstituted piperidines and homopiperidines as potent dual NK1 receptor antagonists-serotonin reuptake transporter inhibitors for the treatment of depression. Bioorg Med Chem21:2217-28 (2013) 
 
Substance-P receptor
Name:Substance-P receptor
Type:G Protein-Coupled Receptor (GPCR)
Mol. Mass.:46254.43
Organism:Homo sapiens (Human)
Description:P25103
Residue:407
BDBM50034271
NameBDBM50034271
Synonyms:4-(3,5-Bis-trifluoromethyl-benzyloxymethyl)-4-phenyl-piperidine | CHEMBL422931
TypeSmall organic molecule
Emp. Form.C21H21F6NO
Mol. Mass.417.388
SMILESFC(F)(F)c1cc(COCC2(CCNCC2)c2ccccc2)cc(c1)C(F)(F)F