Reaction Details
TargetSodium-dependent serotonin transporter
LigandBDBM22416
Substrate/Competitorn/a
Meas. Tech.ChEMBL_951590 (CHEMBL2351265)
IC50 0.200000±n/a nM
Citation Wu, YJHe, HBertekap, RWestphal, RLelas, SNewton, AWallace, TTaber, MDavis, CMacor, JEBronson, J Discovery of disubstituted piperidines and homopiperidines as potent dual NK1 receptor antagonists-serotonin reuptake transporter inhibitors for the treatment of depression. Bioorg Med Chem21:2217-28 (2013) 
 
Sodium-dependent serotonin transporter
Name:Sodium-dependent serotonin transporter
Type:Multi-pass membrane protein
Mol. Mass.:70322.51
Organism:Homo sapiens (Human)
Description:P31645
Residue:630
BDBM22416
NameBDBM22416
Synonyms:(3S,4R)-3-[(1,3-benzodioxol-5-yloxy)methyl]-4-(4-fluorophenyl)piperidine CHEMBL490 US09969700, Paroxetine [3H]Paroxetine
Typeradiolabeled ligand
Emp. Form.C19H20FNO3
Mol. Mass.329.3654
SMILESFc1ccc(cc1)[C@@H]1CCNC[C@H]1COc1ccc2OCOc2c1