Reaction Details
TargetFarnesyl pyrophosphate synthase
LigandBDBM50432306
Substrate/Competitorn/a
Meas. Tech.ChEMBL_951594 (CHEMBL2351269)
IC50 390±n/a nM
Citation Leung, CYLangille, AMMancuso, JTsantrizos, YS Discovery of thienopyrimidine-based inhibitors of the human farnesyl pyrophosphate synthase--parallel synthesis of analogs via a trimethylsilyl ylidene intermediate. Bioorg Med Chem21:2229-40 (2013) 
 
Farnesyl pyrophosphate synthase
Name:Farnesyl pyrophosphate synthase
Type:Enzyme
Mol. Mass.:48272.89
Organism:Homo sapiens (Human)
Description:P14324
Residue:419
BDBM50432306
NameBDBM50432306
Synonyms:CHEMBL2347862
TypeSmall organic molecule
Emp. Form.C14H15N3O6P2S
Mol. Mass.415.298
SMILESCc1ccc(cc1)-c1cc2c(NC(P(O)(O)=O)P(O)(O)=O)ncnc2s1