Reaction Details
TargetMitogen-activated protein kinase 8
LigandBDBM50432373
Substrate/Competitorn/a
Meas. Tech.ChEMBL_952218 (CHEMBL2351014)
IC50>10000±n/a nM
Citation Kawakita, YSeto, MOhashi, TTamura, TYusa, TMiki, HIwata, HKamiguchi, HTanaka, TSogabe, SOhta, YIshikawa, T Design and synthesis of novel pyrimido[4,5-b]azepine derivatives as HER2/EGFR dual inhibitors. Bioorg Med Chem21:2250-61 (2013) 
 
Mitogen-activated protein kinase 8
Name:Mitogen-activated protein kinase 8
Type:Enzyme
Mol. Mass.:48297.57
Organism:Homo sapiens (Human)
Description:JNK-1 was purchased from Upstate Cell Signaling Solutions (formerly Upstate Biotechnology).
Residue:427
BDBM50432373
NameBDBM50432373
Synonyms:CHEMBL2348417
TypeSmall organic molecule
Emp. Form.C25H22ClN5O3S
Mol. Mass.507.992
SMILESOCCNC(=O)C1=Cc2c(Nc3ccc(Oc4cccc5sccc45)c(Cl)c3)ncnc2NCC1