Reaction Details
TargetInhibitor of nuclear factor kappa-B kinase subunit beta
LigandBDBM50432373
Substrate/Competitorn/a
Meas. Tech.ChEMBL_952219 (CHEMBL2351015)
IC50>10000±n/a nM
Citation Kawakita, YSeto, MOhashi, TTamura, TYusa, TMiki, HIwata, HKamiguchi, HTanaka, TSogabe, SOhta, YIshikawa, T Design and synthesis of novel pyrimido[4,5-b]azepine derivatives as HER2/EGFR dual inhibitors. Bioorg Med Chem21:2250-61 (2013) 
 
Inhibitor of nuclear factor kappa-B kinase subunit beta
Name:Inhibitor of nuclear factor kappa-B kinase subunit beta
Type:Serine/threonine-protein kinase
Mol. Mass.:86554.39
Organism:Homo sapiens (Human)
Description:GST-tagged IKK-2 was expressed in High Five cells and purified.
Residue:756
BDBM50432373
NameBDBM50432373
Synonyms:CHEMBL2348417
TypeSmall organic molecule
Emp. Form.C25H22ClN5O3S
Mol. Mass.507.992
SMILESOCCNC(=O)C1=Cc2c(Nc3ccc(Oc4cccc5sccc45)c(Cl)c3)ncnc2NCC1