Reaction Details
TargetEpidermal growth factor receptor
LigandBDBM50358430
Substrate/Competitorn/a
Meas. Tech.ChEMBL_952256 (CHEMBL2351562)
IC50 23±n/a nM
Citation Kawakita, YSeto, MOhashi, TTamura, TYusa, TMiki, HIwata, HKamiguchi, HTanaka, TSogabe, SOhta, YIshikawa, T Design and synthesis of novel pyrimido[4,5-b]azepine derivatives as HER2/EGFR dual inhibitors. Bioorg Med Chem21:2250-61 (2013) 
 
Epidermal growth factor receptor
Name:Epidermal growth factor receptor
Type:Receptor Kinase Domain
Mol. Mass.:134279.59
Organism:Homo sapiens (Human)
Description:P00533
Residue:1210
BDBM50358430
NameBDBM50358430
Synonyms:CHEMBL1614725
TypeSmall organic molecule
Emp. Form.C26H25ClF3N5O3
Mol. Mass.547.957
SMILESCC(C)(O)CC(=O)NCCn1ccc2ncnc(Nc3ccc(Oc4cccc(c4)C(F)(F)F)c(Cl)c3)c12