Reaction Details
TargetReceptor tyrosine-protein kinase erbB-2
LigandBDBM50432377
Substrate/Competitorn/a
Meas. Tech.ChEMBL_952257 (CHEMBL2351563)
IC50 29±n/a nM
Citation Kawakita, YSeto, MOhashi, TTamura, TYusa, TMiki, HIwata, HKamiguchi, HTanaka, TSogabe, SOhta, YIshikawa, T Design and synthesis of novel pyrimido[4,5-b]azepine derivatives as HER2/EGFR dual inhibitors. Bioorg Med Chem21:2250-61 (2013) 
 
Receptor tyrosine-protein kinase erbB-2
Name:Receptor tyrosine-protein kinase erbB-2
Type:n/a
Mol. Mass.:137894.47
Organism:Homo sapiens (Human)
Description:P04626
Residue:1255
BDBM50432377
NameBDBM50432377
Synonyms:CHEMBL2348414
TypeSmall organic molecule
Emp. Form.C24H21ClF3N5O3
Mol. Mass.519.903
SMILESOCCNC(=O)C1=Cc2c(Nc3ccc(Oc4cccc(c4)C(F)(F)F)c(Cl)c3)ncnc2NCC1