Reaction Details
TargetCarbonic anhydrase 9
LigandBDBM50432379
Substrate/Competitorn/a
Meas. Tech.ChEMBL_952508 (CHEMBL2353330)
Ki 57±n/a nM
Citation Biswas, SCarta, FScozzafava, AMcKenna, RSupuran, CT Structural effect of phenyl ring compared to thiadiazole based adamantyl-sulfonamides on carbonic anhydrase inhibition. Bioorg Med Chem21:2314-8 (2013) 
 
Carbonic anhydrase 9
Name:Carbonic anhydrase 9
Type:Enzyme
Mol. Mass.:49669.03
Organism:Homo sapiens (Human)
Description:Catalytic domain of human cloned isozyme was used in the assay
Residue:459
BDBM50432379
NameBDBM50432379
Synonyms:CHEMBL2348438
TypeSmall organic molecule
Emp. Form.C18H24N2O3S
Mol. Mass.348.46
SMILESNS(=O)(=O)c1ccc(NC(=O)CC23CC4CC(CC(C4)C2)C3)cc1