Reaction Details
TargetCarbonic anhydrase 2
LigandBDBM50108563
Substrate/Competitorn/a
Meas. Tech.ChEMBL_952510 (CHEMBL2353332)
Ki 10.0±n/a nM
Citation Biswas, SCarta, FScozzafava, AMcKenna, RSupuran, CT Structural effect of phenyl ring compared to thiadiazole based adamantyl-sulfonamides on carbonic anhydrase inhibition. Bioorg Med Chem21:2314-8 (2013) 
 
Carbonic anhydrase 2
Name:Carbonic anhydrase 2
Type:Enzyme
Mol. Mass.:29250.71
Organism:Homo sapiens (Human)
Description:P00918
Residue:260
BDBM50108563
NameBDBM50108563
Synonyms:Adamantane-1-carboxylic acid (5-sulfamoyl-[1,3,4]thiadiazol-2-yl)-amide | CHEMBL108971
TypeSmall organic molecule
Emp. Form.C13H18N4O3S2
Mol. Mass.342.437
SMILESNS(=O)(=O)c1nnc(NC(=O)C23C[C@H]4C[C@H](C[C@H](C4)C2)C3)s1