Reaction Details
TargetCX3C chemokine receptor 1
LigandBDBM50432427
Substrate/Competitorn/a
Meas. Tech.ChEMBL_953474 (CHEMBL2351085)
Ki 10.0±n/a nM
Citation Karlström, SNordvall, GSohn, DHettman, ATurek, DÅhlin, KKers, AClaesson, MSlivo, CLo-Alfredsson, YPetersson, CBessidskaia, GSvensson, PHRein, TJerning, EMalmberg, ÅAhlgen, CRay, CVares, LIvanov, VJohansson, R Substituted 7-amino-5-thio-thiazolo[4,5-d]pyrimidines as potent and selective antagonists of the fractalkine receptor (CX3CR1). J Med Chem56:3177-90 (2013) 
 
CX3C chemokine receptor 1
Name:CX3C chemokine receptor 1
Type:PROTEIN
Mol. Mass.:40399.45
Organism:Homo sapiens (Human)
Description:ChEMBL_953474
Residue:355
BDBM50432427
NameBDBM50432427
Synonyms:CHEMBL2349306
TypeSmall organic molecule
Emp. Form.C18H20F2N4O2S2
Mol. Mass.426.504
SMILESCC(C)C[C@H](CO)Nc1nc(SCc2cccc(F)c2F)[nH]c2nc(=O)sc12