Reaction Details
TargetC-X-C chemokine receptor type 2
LigandBDBM50371770
Substrate/Competitorn/a
Meas. Tech.ChEMBL_953473 (CHEMBL2351084)
IC50 13±n/a nM
Citation Karlström, SNordvall, GSohn, DHettman, ATurek, DÅhlin, KKers, AClaesson, MSlivo, CLo-Alfredsson, YPetersson, CBessidskaia, GSvensson, PHRein, TJerning, EMalmberg, ÅAhlgen, CRay, CVares, LIvanov, VJohansson, R Substituted 7-amino-5-thio-thiazolo[4,5-d]pyrimidines as potent and selective antagonists of the fractalkine receptor (CX3CR1). J Med Chem56:3177-90 (2013) 
 
C-X-C chemokine receptor type 2
Name:C-X-C chemokine receptor type 2
Type:Protein
Mol. Mass.:40767.88
Organism:Homo sapiens (Human)
Description:P25025
Residue:360
BDBM50371770
NameBDBM50371770
Synonyms:CHEMBL271013
TypeSmall organic molecule
Emp. Form.C15H17N5OS2
Mol. Mass.347.458
SMILESC[C@H](CO)Nc1nc(SCc2ccccc2)nc2nc(N)sc12