Reaction Details
TargetCX3C chemokine receptor 1
LigandBDBM50432449
Substrate/Competitorn/a
Meas. Tech.ChEMBL_953474 (CHEMBL2351085)
Ki 8.0±n/a nM
Citation Karlström, SNordvall, GSohn, DHettman, ATurek, DÅhlin, KKers, AClaesson, MSlivo, CLo-Alfredsson, YPetersson, CBessidskaia, GSvensson, PHRein, TJerning, EMalmberg, ÅAhlgen, CRay, CVares, LIvanov, VJohansson, R Substituted 7-amino-5-thio-thiazolo[4,5-d]pyrimidines as potent and selective antagonists of the fractalkine receptor (CX3CR1). J Med Chem56:3177-90 (2013) 
 
CX3C chemokine receptor 1
Name:CX3C chemokine receptor 1
Type:PROTEIN
Mol. Mass.:40399.45
Organism:Homo sapiens (Human)
Description:ChEMBL_953474
Residue:355
BDBM50432449
NameBDBM50432449
Synonyms:CHEMBL2349313
TypeSmall organic molecule
Emp. Form.C19H24N4O2S2
Mol. Mass.404.549
SMILESCC(C)C[C@H](CO)Nc1nc(S[C@H](C)c2ccccc2)[nH]c2nc(=O)sc12