Reaction Details
TargetHistone deacetylase 2
LigandBDBM22164
Substrate/Competitorn/a
Meas. Tech.ChEMBL_950484 (CHEMBL2351477)
IC50 22547±n/a nM
Citation Chen, JBChern, TRWei, TTChen, CCLin, JHFang, JM Design and synthesis of dual-action inhibitors targeting histone deacetylases and 3-hydroxy-3-methylglutaryl coenzyme A reductase for cancer treatment. J Med Chem56:3645-55 (2013) 
 
Histone deacetylase 2
Name:Histone deacetylase 2
Type:Chromatin regulator; hydrolase; repressor
Mol. Mass.:55356.54
Organism:Homo sapiens (Human)
Description:Q92769
Residue:488
BDBM22164
NameBDBM22164
Synonyms:(3R,5R)-7-[2-(4-fluorophenyl)-3-phenyl-4-(phenylcarbamoyl)-5-(propan-2-yl)-1H-pyrrol-1-yl]-3,5-dihydroxyheptanoic acid Atorvastatin CI 981 US9353061, Atorvastatina
TypeSmall organic molecule
Emp. Form.C33H35FN2O5
Mol. Mass.558.6398
SMILESCC(C)c1c(C(=O)Nc2ccccc2)c(c(-c2ccc(F)cc2)n1CC[C@@H](O)C[C@@H](O)CC(O)=O)-c1ccccc1