Reaction Details
TargetSodium-dependent serotonin transporter
LigandBDBM50432575
Substrate/Competitorn/a
Meas. Tech.ChEMBL_950695 (CHEMBL2352938)
Ki 2.3±n/a nM
Citation Soubhye, JAldib, IElfving, BGelbcke, MFurtmüller, PGPodrecca, MConotte, RColet, JMRousseau, AReye, FSarakbi, AVanhaeverbeek, MKauffmann, JMObinger, CNève, JPrévost, MZouaoui Boudjeltia, KDufrasne, FVan Antwerpen, P Design, synthesis, and structure-activity relationship studies of novel 3-alkylindole derivatives as selective and highly potent myeloperoxidase inhibitors. J Med Chem56:3943-58 (2013) 
 
Sodium-dependent serotonin transporter
Name:Sodium-dependent serotonin transporter
Type:Multi-pass membrane protein
Mol. Mass.:70322.51
Organism:Homo sapiens (Human)
Description:P31645
Residue:630
BDBM50432575
NameBDBM50432575
Synonyms:CHEMBL2347168
TypeSmall organic molecule
Emp. Form.C12H15FN2S
Mol. Mass.238.324
SMILESNCCSCCc1c[nH]c2ccc(F)cc12