Reaction Details
TargetBeta-secretase 1
LigandBDBM50432614
Substrate/Competitorn/a
Meas. Tech.ChEMBL_951004 (CHEMBL2350618)
IC50 1±n/a nM
Citation Hilpert, HGuba, WWoltering, TJWostl, WPinard, EMauser, HMayweg, AVRogers-Evans, MHumm, RKrummenacher, DMuser, TSchnider, CJacobsen, HOzmen, LBergadano, ABanner, DWHochstrasser, RKuglstatter, ADavid-Pierson, PFischer, HPolara, ANarquizian, R ß-Secretase (BACE1) inhibitors with high in vivo efficacy suitable for clinical evaluation in Alzheimer's disease. J Med Chem56:3980-95 (2013) 
 
Beta-secretase 1
Name:Beta-secretase 1
Type:Protein
Mol. Mass.:55755.10
Organism:Homo sapiens (Human)
Description:P56817
Residue:501
BDBM50432614
NameBDBM50432614
Synonyms:CHEMBL2347198
TypeSmall organic molecule
Emp. Form.C20H18F3N5O3
Mol. Mass.433.3838
SMILESCC#CCOc1cnc(cn1)C(=O)Nc1ccc(F)c(c1)[C@@]1(C)N=C(N)OCC1(F)F