Reaction Details
TargetBeta-secretase 2
LigandBDBM50432610
Substrate/Competitorn/a
Meas. Tech.ChEMBL_950723 (CHEMBL2353184)
IC50 11±n/a nM
Citation Hilpert, HGuba, WWoltering, TJWostl, WPinard, EMauser, HMayweg, AVRogers-Evans, MHumm, RKrummenacher, DMuser, TSchnider, CJacobsen, HOzmen, LBergadano, ABanner, DWHochstrasser, RKuglstatter, ADavid-Pierson, PFischer, HPolara, ANarquizian, R ß-Secretase (BACE1) inhibitors with high in vivo efficacy suitable for clinical evaluation in Alzheimer's disease. J Med Chem56:3980-95 (2013) 
 
Beta-secretase 2
Name:Beta-secretase 2
Type:Protein
Mol. Mass.:56171.20
Organism:Homo sapiens (Human)
Description:Q9Y5Z0
Residue:518
BDBM50432610
NameBDBM50432610
Synonyms:CHEMBL2347202
TypeSmall organic molecule
Emp. Form.C16H13ClF5N5O2
Mol. Mass.437.752
SMILESC[C@@]1(N=C(N)OCC1(F)F)c1cc(NC(=O)c2nn(cc2Cl)C(F)F)ccc1F