Reaction Details
TargetBeta-secretase 2
LigandBDBM50432632
Substrate/Competitorn/a
Meas. Tech.ChEMBL_950723 (CHEMBL2353184)
IC50 9.0±n/a nM
Citation Hilpert, HGuba, WWoltering, TJWostl, WPinard, EMauser, HMayweg, AVRogers-Evans, MHumm, RKrummenacher, DMuser, TSchnider, CJacobsen, HOzmen, LBergadano, ABanner, DWHochstrasser, RKuglstatter, ADavid-Pierson, PFischer, HPolara, ANarquizian, R ß-Secretase (BACE1) inhibitors with high in vivo efficacy suitable for clinical evaluation in Alzheimer's disease. J Med Chem56:3980-95 (2013) 
 
Beta-secretase 2
Name:Beta-secretase 2
Type:Protein
Mol. Mass.:56171.20
Organism:Homo sapiens (Human)
Description:Q9Y5Z0
Residue:518
BDBM50432632
NameBDBM50432632
Synonyms:CHEMBL2347211
TypeSmall organic molecule
Emp. Form.C17H16ClFN4OS
Mol. Mass.378.852
SMILESC[C@]1(CCSC(N)=N1)c1cc(NC(=O)c2ccc(Cl)cn2)ccc1F