Reaction Details
TargetCytochrome P450 2B6
LigandBDBM50014323
Substrate/Competitorn/a
Meas. Tech.ChEMBL_951965 (CHEMBL2354042)
IC50 13000±n/a nM
Citation Liu, JTaylor, SFDupart, PSArnold, CLSridhar, JJiang, QWang, YSkripnikova, EVZhao, MForoozesh, M Pyranoflavones: a group of small-molecule probes for exploring the active site cavities of cytochrome P450 enzymes 1A1, 1A2, and 1B1. J Med Chem56:4082-92 (2013) 
 
Cytochrome P450 2B6
Name:Cytochrome P450 2B6
Type:Protein
Mol. Mass.:56289.75
Organism:Homo sapiens (Human)
Description:P20813
Residue:491
BDBM50014323
NameBDBM50014323
Synonyms:2-PHENYL-4H-BENZO[H]CHROMEN-4-ONE 7,8-Benzoflavone alpha-naphthoflavone
TypeSmall organic molecule
Emp. Form.C19H12O2
Mol. Mass.272.2974
SMILESO=c1cc(oc2c3ccccc3ccc12)-c1ccccc1