Reaction Details
TargetCytochrome P450 1A2
LigandBDBM50432672
Substrate/Competitorn/a
Meas. Tech.ChEMBL_951977 (CHEMBL2354054)
IC50 14±n/a nM
Citation Liu, JTaylor, SFDupart, PSArnold, CLSridhar, JJiang, QWang, YSkripnikova, EVZhao, MForoozesh, M Pyranoflavones: a group of small-molecule probes for exploring the active site cavities of cytochrome P450 enzymes 1A1, 1A2, and 1B1. J Med Chem56:4082-92 (2013) 
 
Cytochrome P450 1A2
Name:Cytochrome P450 1A2
Type:Enzyme
Mol. Mass.:58423.38
Organism:Homo sapiens (Human)
Description:P05177
Residue:516
BDBM50432672
NameBDBM50432672
Synonyms:CHEMBL2347912
TypeSmall organic molecule
Emp. Form.C18H12O4
Mol. Mass.292.2855
SMILESOc1cc2OCC=Cc2c2oc(cc(=O)c12)-c1ccccc1