Reaction Details
TargetEpidermal growth factor receptor
LigandBDBM50432684
Substrate/Competitorn/a
Meas. Tech.ChEMBL_952261 (CHEMBL2351567)
IC50 34±n/a nM
Citation Peng, YHShiao, HYTu, CHLiu, PMHsu, JTAmancha, PKWu, JSCoumar, MSChen, CHWang, SYLin, WHSun, HYChao, YSLyu, PCHsieh, HPWu, SY Protein kinase inhibitor design by targeting the Asp-Phe-Gly (DFG) motif: the role of the DFG motif in the design of epidermal growth factor receptor inhibitors. J Med Chem56:3889-903 (2013) 
 
Epidermal growth factor receptor
Name:Epidermal growth factor receptor
Type:Receptor Kinase Domain
Mol. Mass.:134279.59
Organism:Homo sapiens (Human)
Description:P00533
Residue:1210
BDBM50432684
NameBDBM50432684
Synonyms:CHEMBL2347961
TypeSmall organic molecule
Emp. Form.C33H35N5O3
Mol. Mass.549.6627
SMILESCN(C)CCCCC(=O)Nc1cccc(c1)-c1c(oc2ncnc(N[C@H](CO)c3ccccc3)c12)-c1ccccc1