Reaction Details
TargetEpidermal growth factor receptor
LigandBDBM50432685
Substrate/Competitorn/a
Meas. Tech.ChEMBL_952261 (CHEMBL2351567)
IC50 29±n/a nM
Citation Peng, YHShiao, HYTu, CHLiu, PMHsu, JTAmancha, PKWu, JSCoumar, MSChen, CHWang, SYLin, WHSun, HYChao, YSLyu, PCHsieh, HPWu, SY Protein kinase inhibitor design by targeting the Asp-Phe-Gly (DFG) motif: the role of the DFG motif in the design of epidermal growth factor receptor inhibitors. J Med Chem56:3889-903 (2013) 
 
Epidermal growth factor receptor
Name:Epidermal growth factor receptor
Type:Receptor Kinase Domain
Mol. Mass.:134279.59
Organism:Homo sapiens (Human)
Description:P00533
Residue:1210
BDBM50432685
NameBDBM50432685
Synonyms:CHEMBL2347960
TypeSmall organic molecule
Emp. Form.C32H33N5O3
Mol. Mass.535.6361
SMILESCN(C)CCCC(=O)Nc1cccc(c1)-c1c(oc2ncnc(N[C@H](CO)c3ccccc3)c12)-c1ccccc1