Reaction Details
TargetBeta-1 adrenergic receptor
LigandBDBM50432707
Substrate/Competitorn/a
Meas. Tech.ChEMBL_952276 (CHEMBL2351582)
EC50 2.3±n/a nM
Citation Mistry, SNBaker, JGFischer, PMHill, SJGardiner, SMKellam, B Synthesis and in vitro and in vivo characterization of highlyß1-selectiveß-adrenoceptor partial agonists. J Med Chem56:3852-65 (2013) 
 
Beta-1 adrenergic receptor
Name:Beta-1 adrenergic receptor
Type:G Protein-Coupled Receptor (GPCR)
Mol. Mass.:51338.40
Organism:Homo sapiens (Human)
Description:P08588
Residue:477
BDBM50432707
NameBDBM50432707
Synonyms:LK-204-545 | LK-204545
TypeSmall organic molecule
Emp. Form.C25H32N4O6
Mol. Mass.484.5448
SMILESOC(CNCCNC(=O)Nc1ccc(O)cc1)COc1ccc(OCCOCC2CC2)cc1C#N