Reaction Details
TargetCannabinoid receptor 1
LigandBDBM50432712
Substrate/Competitorn/a
Meas. Tech.ChEMBL_952579 (CHEMBL2354092)
EC50 8.0±n/a nM
Citation Thakur, GABajaj, SParonis, CPeng, YBowman, ALBarak, LSCaron, MGParrish, DDeschamps, JRMakriyannis, A Novel adamantyl cannabinoids as CB1 receptor probes. J Med Chem56:3904-21 (2013) 
 
Cannabinoid receptor 1
Name:Cannabinoid receptor 1
Type:G Protein-Coupled Receptor (GPCR)
Mol. Mass.:52868.96
Organism:Homo sapiens (Human)
Description:P21554
Residue:472
BDBM50432712
NameBDBM50432712
Synonyms:AM4089 | CHEMBL2348473
TypeSmall organic molecule
Emp. Form.C26H30O3
Mol. Mass.390.5146
SMILESCC1(C)Oc2cc(cc(O)c2-c2cc(CO)ccc12)C12CC3CC(CC(C3)C1)C2