Reaction Details
TargetCannabinoid receptor 1
LigandBDBM50432714
Substrate/Competitorn/a
Meas. Tech.ChEMBL_952578 (CHEMBL2354091)
EC50 1.3±n/a nM
Citation Thakur, GABajaj, SParonis, CPeng, YBowman, ALBarak, LSCaron, MGParrish, DDeschamps, JRMakriyannis, A Novel adamantyl cannabinoids as CB1 receptor probes. J Med Chem56:3904-21 (2013) 
 
Cannabinoid receptor 1
Name:Cannabinoid receptor 1
Type:G Protein-Coupled Receptor (GPCR)
Mol. Mass.:52868.96
Organism:Homo sapiens (Human)
Description:P21554
Residue:472
BDBM50432714
NameBDBM50432714
Synonyms:AM4054 | CHEMBL2348462
TypeSmall organic molecule
Emp. Form.C26H36O3
Mol. Mass.396.5622
SMILESCC1(C)Oc2cc(cc(O)c2[C@@H]2C[C@H](CO)CC[C@@H]12)C12CC3CC(CC(C3)C1)C2