Reaction Details
TargetCannabinoid receptor 2
LigandBDBM50432726
Substrate/Competitorn/a
Meas. Tech.ChEMBL_952581 (CHEMBL2354094)
Ki 262±n/a nM
Citation Thakur, GABajaj, SParonis, CPeng, YBowman, ALBarak, LSCaron, MGParrish, DDeschamps, JRMakriyannis, A Novel adamantyl cannabinoids as CB1 receptor probes. J Med Chem56:3904-21 (2013) 
 
Cannabinoid receptor 2
Name:Cannabinoid receptor 2
Type:G Protein-Coupled Receptor (GPCR)
Mol. Mass.:39690.94
Organism:Homo sapiens (Human)
Description:P34972
Residue:360
BDBM50432726
NameBDBM50432726
Synonyms:CHEMBL2348463
TypeSmall organic molecule
Emp. Form.C26H35IO2
Mol. Mass.506.4594
SMILESCC1(C)Oc2cc(cc(O)c2[C@@H]2C[C@H](CI)CC[C@@H]12)C12CC3CC(CC(C3)C1)C2