Reaction Details
TargetCannabinoid receptor 2
LigandBDBM50432729
Substrate/Competitorn/a
Meas. Tech.ChEMBL_952581 (CHEMBL2354094)
Ki 9.0±n/a nM
Citation Thakur, GABajaj, SParonis, CPeng, YBowman, ALBarak, LSCaron, MGParrish, DDeschamps, JRMakriyannis, A Novel adamantyl cannabinoids as CB1 receptor probes. J Med Chem56:3904-21 (2013) 
 
Cannabinoid receptor 2
Name:Cannabinoid receptor 2
Type:G Protein-Coupled Receptor (GPCR)
Mol. Mass.:39690.94
Organism:Homo sapiens (Human)
Description:P34972
Residue:360
BDBM50432729
NameBDBM50432729
Synonyms:CHEMBL2348460
TypeSmall organic molecule
Emp. Form.C26H34O3
Mol. Mass.394.5464
SMILESCC1(C)Oc2cc(cc(O)c2[C@@H]2C[C@H](CC[C@@H]12)C=O)C12CC3CC(CC(C3)C1)C2