Reaction Details
TargetCannabinoid receptor 2
LigandBDBM50432720
Substrate/Competitorn/a
Meas. Tech.ChEMBL_952584 (CHEMBL2354097)
Ki 8.1±n/a nM
Citation Thakur, GABajaj, SParonis, CPeng, YBowman, ALBarak, LSCaron, MGParrish, DDeschamps, JRMakriyannis, A Novel adamantyl cannabinoids as CB1 receptor probes. J Med Chem56:3904-21 (2013) 
 
Cannabinoid receptor 2
Name:Cannabinoid receptor 2
Type:Enzyme Catalytic Domain
Mol. Mass.:38220.43
Organism:MOUSE
Description:P47936
Residue:347
BDBM50432720
NameBDBM50432720
Synonyms:CHEMBL2348469
TypeSmall organic molecule
Emp. Form.C27H36O3
Mol. Mass.408.5729
SMILESCC1(C)Oc2cc(cc(O)c2[C@@H]2C[C@@H](CC=O)CC[C@@H]12)C12CC3CC(CC(C3)C1)C2