Reaction Details
TargetCannabinoid receptor 1
LigandBDBM50432712
Substrate/Competitorn/a
Meas. Tech.ChEMBL_952585 (CHEMBL2354098)
Ki 2.1±n/a nM
Citation Thakur, GABajaj, SParonis, CPeng, YBowman, ALBarak, LSCaron, MGParrish, DDeschamps, JRMakriyannis, A Novel adamantyl cannabinoids as CB1 receptor probes. J Med Chem56:3904-21 (2013) 
 
Cannabinoid receptor 1
Name:Cannabinoid receptor 1
Type:G Protein-Coupled Receptor (GPCR)
Mol. Mass.:52856.55
Organism:Rattus norvegicus (rat)
Description:P20272
Residue:473
BDBM50432712
NameBDBM50432712
Synonyms:AM4089 | CHEMBL2348473
TypeSmall organic molecule
Emp. Form.C26H30O3
Mol. Mass.390.5146
SMILESCC1(C)Oc2cc(cc(O)c2-c2cc(CO)ccc12)C12CC3CC(CC(C3)C1)C2