Reaction Details
TargetCannabinoid receptor 1
LigandBDBM50432725
Substrate/Competitorn/a
Meas. Tech.ChEMBL_952585 (CHEMBL2354098)
Ki 49±n/a nM
Citation Thakur, GABajaj, SParonis, CPeng, YBowman, ALBarak, LSCaron, MGParrish, DDeschamps, JRMakriyannis, A Novel adamantyl cannabinoids as CB1 receptor probes. J Med Chem56:3904-21 (2013) 
 
Cannabinoid receptor 1
Name:Cannabinoid receptor 1
Type:G Protein-Coupled Receptor (GPCR)
Mol. Mass.:52856.55
Organism:Rattus norvegicus (rat)
Description:P20272
Residue:473
BDBM50432725
NameBDBM50432725
Synonyms:CHEMBL2348464
TypeSmall organic molecule
Emp. Form.C27H35NO2
Mol. Mass.405.5723
SMILESCC1(C)Oc2cc(cc(O)c2[C@@H]2C[C@H](CC#N)CC[C@@H]12)C12CC3CC(CC(C3)C1)C2