Reaction Details
TargetCannabinoid receptor 1
LigandBDBM50432730
Substrate/Competitorn/a
Meas. Tech.ChEMBL_952585 (CHEMBL2354098)
Ki 53±n/a nM
Citation Thakur, GABajaj, SParonis, CPeng, YBowman, ALBarak, LSCaron, MGParrish, DDeschamps, JRMakriyannis, A Novel adamantyl cannabinoids as CB1 receptor probes. J Med Chem56:3904-21 (2013) 
 
Cannabinoid receptor 1
Name:Cannabinoid receptor 1
Type:G Protein-Coupled Receptor (GPCR)
Mol. Mass.:52856.55
Organism:Rattus norvegicus (rat)
Description:P20272
Residue:473
BDBM50432730
NameBDBM50432730
Synonyms:CHEMBL2348459
TypeSmall organic molecule
Emp. Form.C26H34O3
Mol. Mass.394.5464
SMILESCC1(C)Oc2cc(cc(O)c2[C@@H]2C[C@@H](CC[C@@H]12)C=O)C12CC3CC(CC(C3)C1)C2