Reaction Details
TargetPeptidyl-prolyl cis-trans isomerase FKBP5
LigandBDBM50432743
Substrate/Competitorn/a
Meas. Tech.ChEMBL_952910 (CHEMBL2351899)
Ki 27000±n/a nM
Citation Wang, YKirschner, AFabian, AKGopalakrishnan, RKress, CHoogeland, BKoch, UKozany, CBracher, AHausch, F Increasing the efficiency of ligands for FK506-binding protein 51 by conformational control. J Med Chem56:3922-35 (2013) 
 
Peptidyl-prolyl cis-trans isomerase FKBP5
Name:Peptidyl-prolyl cis-trans isomerase FKBP5
Type:PROTEIN
Mol. Mass.:51207.06
Organism:Homo sapiens (Human)
Description:ChEMBL_952910
Residue:457
BDBM50432743
NameBDBM50432743
Synonyms:CHEMBL2348596
TypeSmall organic molecule
Emp. Form.C14H15N3O4S2
Mol. Mass.353.417
SMILESO=C1NCC2CCCC1N2S(=O)(=O)c1ccc2[nH]c(=O)sc2c1