Reaction Details
TargetE3 ubiquitin-protein ligase XIAP
LigandBDBM50432760
Substrate/Competitorn/a
Meas. Tech.ChEMBL_952938 (CHEMBL2351927)
Ki 0.700000±n/a nM
Citation Sheng, RSun, HLiu, LLu, JMcEachern, DWang, GWen, JMin, PDu, ZLu, HKang, SGuo, MYang, DWang, S A potent bivalent Smac mimetic (SM-1200) achieving rapid, complete, and durable tumor regression in mice. J Med Chem56:3969-79 (2013) 
 
E3 ubiquitin-protein ligase XIAP
Name:E3 ubiquitin-protein ligase XIAP
Type:Protein
Mol. Mass.:56685.27
Organism:Homo sapiens (Human)
Description:P98170
Residue:497
BDBM50432760
NameBDBM50432760
Synonyms:CHEMBL2348620
TypeSmall organic molecule
Emp. Form.C69H80N12O8
Mol. Mass.1205.4491
SMILESCN[C@@H](C)C(=O)N[C@H]1CN(CC[C@H]2CC[C@H](N2C1=O)C(=O)NC(c1ccccc1)c1ccccc1)C(=O)Nc1ccc(Cc2ccc(NC(=O)N3CC[C@H]4CC[C@H](N4C(=O)[C@H](C3)NC(=O)[C@H](C)NC)C(=O)NC(c3ccccc3)c3ccccc3)cc2)cc1