Reaction Details
TargetFatty-acid amide hydrolase 1 [30-579]
LigandBDBM50432841
Substrate/Competitorn/a
Meas. Tech.ChEMBL_956341 (CHEMBL2379575)
IC50 8.0±n/a nM
Citation Holtfrerich, AHanekamp, WLehr, M (4-Phenoxyphenyl)tetrazolecarboxamides and related compounds as dual inhibitors of fatty acid amide hydrolase (FAAH) and monoacylglycerol lipase (MAGL). Eur J Med Chem63:64-75 (2013) 
 
Fatty-acid amide hydrolase 1 [30-579]
Name:Fatty-acid amide hydrolase 1 [30-579]
Type:Single-pass membrane protein; homodimer
Mol. Mass.:60474.00
Organism:Rattus norvegicus (rat)
Description:P97612 (aa 30-579)
Residue:550
BDBM50432841
NameBDBM50432841
Synonyms:CHEMBL2376226
TypeSmall organic molecule
Emp. Form.C13H13N7O
Mol. Mass.283.2886
SMILESCN(C)C(=O)n1nnc(n1)-c1ccc(cc1)-n1cccn1