Reaction Details
TargetFatty-acid amide hydrolase 1 [30-579]
LigandBDBM50432843
Substrate/Competitorn/a
Meas. Tech.ChEMBL_956341 (CHEMBL2379575)
IC50 5.0±n/a nM
Citation Holtfrerich, AHanekamp, WLehr, M (4-Phenoxyphenyl)tetrazolecarboxamides and related compounds as dual inhibitors of fatty acid amide hydrolase (FAAH) and monoacylglycerol lipase (MAGL). Eur J Med Chem63:64-75 (2013) 
 
Fatty-acid amide hydrolase 1 [30-579]
Name:Fatty-acid amide hydrolase 1 [30-579]
Type:Single-pass membrane protein; homodimer
Mol. Mass.:60474.00
Organism:Rattus norvegicus (rat)
Description:P97612 (aa 30-579)
Residue:550
BDBM50432843
NameBDBM50432843
Synonyms:CHEMBL2376224
TypeSmall organic molecule
Emp. Form.C14H14N6O
Mol. Mass.282.3006
SMILESCN(C)C(=O)n1nnc(n1)-c1ccc(cc1)-n1cccc1