Reaction Details
TargetBreakpoint cluster region protein/Tyrosine-protein kinase ABL1
LigandBDBM50290422
Substrate/Competitorn/a
Meas. Tech.ChEMBL_956489 (CHEMBL2379863)
IC50 100±n/a nM
Citation Cui, JFu, RZhou, LHChen, SPLi, GWQian, SXLiu, S BCR-ABL tyrosine kinase inhibitor pharmacophore model derived from a series of phenylaminopyrimidine-based (PAP) derivatives. Bioorg Med Chem Lett23:2442-50 (2013) 
 
Breakpoint cluster region protein/Tyrosine-protein kinase ABL1
Name:Breakpoint cluster region protein/Tyrosine-protein kinase ABL1
Type:Enzyme
Mol. Mass.:n/a
Description:n/a
Components:This complex has 2 components.
Component 1
Name:Tyrosine-protein kinase ABL1
Synonyms:ABL ABL1_HUMAN JTK7 Proto-oncogene tyrosine-protein kinase ABL1 Tyrosine-protein kinase ABL V-abl Abelson murine leukemia viral oncogene homolog 1 p150 | tyrosine-protein kinase ABL1 isoform a
Type:Enzyme
Mol. Mass.:122897.30
Organism:Homo sapiens (Human)
Description:P00519
Residue:1130
Component 2
Name:Breakpoint cluster region protein
Synonyms:BCR BCR_HUMAN Breakpoint cluster region protein | D22S11
Type:PROTEIN
Mol. Mass.:142824.75
Organism:Homo sapiens (Human)
Description:ChEMBL_305348
Residue:1271
BDBM50290422
NameBDBM50290422
Synonyms:4-(4-Methyl-piperazin-1-ylmethyl)-N-[3-(4-pyridin-3-yl-pyrimidin-2-ylamino)-phenyl]-benzamide CHEMBL56904
TypeSmall organic molecule
Emp. Form.C28H29N7O
Mol. Mass.479.5762
SMILESCN1CCN(Cc2ccc(cc2)C(=O)Nc2cccc(Nc3nccc(n3)-c3cccnc3)c2)CC1